BDBM406294 US10336729, # 1.048
SMILES COc1ccc(cc1)C1CCN(CC1)c1c(F)c(COC(=O)NC(N)=N)ccc1C#N
InChI Key InChIKey=FGJOHGPNVVOZHZ-UHFFFAOYSA-N
Data  1 IC50
  Tab Delimited (TSV)   2D SDfile   Computed 3D by Vconf -m prep SDfile
Find this compound or compounds like it in BindingDB:
Activity Spreadsheet -- Enzyme Inhibition Constant Data from BindingDB
Found 1 hit for monomerid = 406294
TargetMembrane primary amine oxidase(Homo sapiens (Human))
Boehringer Ingelheim International
US Patent
LigandPNGBDBM406294(US10336729, # 1.048)
Affinity DataIC50:  82nM. Assay description: The MAO-Glo Assay (commercial available from PROMEGA, #V1402) provides a sensitive method for the measurement of monoamine oxidase (MAO) activity (Va...
Ligand InfoPC cidPC sid
In DepthDetails US Patent