BDBM406355 US10336731, Compound 6
SMILES Cn1cc(cn1)C1(CC1)NC(=O)c1cc2cc(Br)cc(F)c2[nH]1
InChI Key InChIKey=UDFJHOQNQHIJRR-UHFFFAOYSA-N
Data  1 IC50
  Tab Delimited (TSV)   2D SDfile   Computed 3D by Vconf -m prep SDfile
Find this compound or compounds like it in BindingDB:
Activity Spreadsheet -- Enzyme Inhibition Constant Data from BindingDB
Found 1 hit for monomerid = 406355
TargetIndoleamine 2,3-dioxygenase 1(Homo sapiens (Human))
Merck Sharp & Dohme
US Patent
LigandPNGBDBM406355(US10336731, Compound 6)
Affinity DataIC50:  1.10E+3nM. Assay description: 0.17 μM of human IDO protein was pre-incubated for 120 min at RT with test compounds in the presence of 50 mM KPO4, pH 7.0, 0.5 mM EDTA, 0.5 mM ...
Ligand InfoPC cidPC sid
In DepthDetails US Patent