BDBM406383 US10336733, Example 27
SMILES CC1(CC1)S(=O)(=O)NC(=O)c1ccccc1-c1ccc2[C@H](O)[C@H](Cc3cscn3)COc2c1
InChI Key InChIKey=DHQVCUABQAKPCV-OPAMFIHVSA-N
Data  1 EC50
  Tab Delimited (TSV)   2D SDfile   Computed 3D by Vconf -m prep SDfile
Find this compound or compounds like it in BindingDB:
Activity Spreadsheet -- Enzyme Inhibition Constant Data from BindingDB
Found 1 hit for monomerid = 406383
TargetLeukotriene B4 receptor 1(Homo sapiens (Human))
Merk Sharp & Dohme
US Patent
LigandPNGBDBM406383(US10336733, Example 27)
Affinity DataEC50:  26nM. Assay description: The ability of compounds to antagonize the human BLT1 receptor was determined using a kit to measure changes in intracellular cyclic AMP levels (cAMP...
Ligand InfoPC cidPC sid
In DepthDetails US Patent