BDBM406389 N-(tert-Butylsulfonyl)-2-((3R,4S or 3S,4R)-4-hydroxy-3-(thiazol-4-ylmethyl)chroman-7-yl)benzamide::US10336733, Example 33
SMILES CC(C)(C)S(=O)(=O)NC(=O)c1ccccc1-c1ccc2[C@@H](O)[C@H](Cc3cscn3)COc2c1
InChI Key InChIKey=PGVLVBJRARVNRB-ZHRRBRCNSA-N
Data  1 EC50
  Tab Delimited (TSV)   2D SDfile   Computed 3D by Vconf -m prep SDfile
Find this compound or compounds like it in BindingDB:
Activity Spreadsheet -- Enzyme Inhibition Constant Data from BindingDB
Found 1 hit for monomerid = 406389
TargetLeukotriene B4 receptor 1(Homo sapiens (Human))
Merk Sharp & Dohme
US Patent
LigandPNGBDBM406389(N-(tert-Butylsulfonyl)-2-((3R,4S or 3S,4R)-4-hydro...)
Affinity DataEC50:  808nM. Assay description: The ability of compounds to antagonize the human BLT1 receptor was determined using a kit to measure changes in intracellular cyclic AMP levels (cAMP...
Ligand InfoPC cidPC sid
In DepthDetails US Patent