BDBM406563 N-({5-[6-butyl-5- (2,6- dimethoxyphenyl)- 2,4- dihydroxypyridin- 3-yl]-1,3,4- oxadiazol-2- yl}methyl)pyridine- 3-carboxamide::US10336739, Example 160
SMILES CCCCc1nc(O)c(-c2nnc(CNC(=O)c3cccnc3)o2)c(O)c1-c1c(OC)cccc1OC
InChI Key InChIKey=USLSCBCBMISAKC-UHFFFAOYSA-N
Data  1 EC50
  Tab Delimited (TSV)   2D SDfile   Computed 3D by Vconf -m prep SDfile
Find this compound or compounds like it in BindingDB:
Activity Spreadsheet -- Enzyme Inhibition Constant Data from BindingDB
Found 1 hit for monomerid = 406563
TargetApelin receptor(Homo sapiens (Human))
Bristol-Myers Squibb
US Patent
LigandPNGBDBM406563(N-({5-[6-butyl-5- (2,6- dimethoxyphenyl)- 2,4- dih...)
Affinity DataEC50:  5.5nM. Assay description: HEK293 cells stably expressing human APJ receptor were used to assess the activity of compounds. Cultured cells were detached and resuspended in the ...
Ligand InfoPC cidPC sid
In DepthDetails US Patent