BDBM406669 1-(3-(7-(4-(morpholinomethyl)phenyl)-1H-pyrazolo[3,4-c]pyridin-5-yl)piperidin-1-yl)prop-2-en-1-one::US10336755, Example 1
SMILES C=CC(=O)N1CCCC(C1)c1cc2cn[nH]c2c(n1)-c1ccc(CN2CCOCC2)cc1
InChI Key
Data  1 IC50
  Tab Delimited (TSV)   2D SDfile   Computed 3D by Vconf -m prep SDfile
Find this compound or compounds like it in BindingDB:
Activity Spreadsheet -- Enzyme Inhibition Constant Data from BindingDB
Found 1 hit for monomerid = 406669
TargetTyrosine-protein kinase BTK(Homo sapiens (Human))
Beijing Innocare Pharma Tech
US Patent
LigandPNGBDBM406669(1-(3-(7-(4-(morpholinomethyl)phenyl)-1H-pyrazolo[3...)
Affinity DataIC50:  300nM. Assay description: In vitro activity of BTK is measured by detecting ADP produced in a kinase reaction with an ADP-Glo™ kinase assay kit from Promega Company. In the ki...
Ligand InfoPC cidPC sid
In DepthDetails US Patent