BDBM406693 1-(2-(7-(4-phenoxyphenyl)-1H-pyrazolo[3,4-c]pyridin-5-yl)pyrrolidin-1-yl)prop-2-en-1-one::US10336755, Example 21
SMILES C=CC(=O)N1CCCC1c1cc2cn[nH]c2c(n1)-c1ccc(Oc2ccccc2)cc1
InChI Key
Data  1 IC50
  Tab Delimited (TSV)   2D SDfile   Computed 3D by Vconf -m prep SDfile
Find this compound or compounds like it in BindingDB:
Activity Spreadsheet -- Enzyme Inhibition Constant Data from BindingDB
Found 1 hit for monomerid = 406693
TargetTyrosine-protein kinase BTK(Homo sapiens (Human))
Beijing Innocare Pharma Tech
US Patent
LigandPNGBDBM406693(1-(2-(7-(4-phenoxyphenyl)-1H-pyrazolo[3,4-c]pyridi...)
Affinity DataIC50: <100nM. Assay description: In vitro activity of BTK is measured by detecting ADP produced in a kinase reaction with an ADP-Glo™ kinase assay kit from Promega Company. In the ki...
Ligand InfoPC cidPC sid
In DepthDetails US Patent