BDBM40678 2-(4-chloranyl-3,5-dimethyl-phenoxy)-N-(4-pyrrolidin-1-ylphenyl)ethanamide::2-(4-chloro-3,5-dimethyl-phenoxy)-N-(4-pyrrolidinophenyl)acetamide::2-(4-chloro-3,5-dimethylphenoxy)-N-(4-pyrrolidin-1-ylphenyl)acetamide::2-(4-chloro-3,5-dimethylphenoxy)-N-[4-(1-pyrrolidinyl)phenyl]acetamide::MLS000534350::SMR000141782::cid_1245566
SMILES Cc1cc(OCC(=O)Nc2ccc(cc2)N2CCCC2)cc(C)c1Cl
InChI Key InChIKey=PXSLRESASRTRRI-UHFFFAOYSA-N
Data  2 IC50
  Tab Delimited (TSV)   2D SDfile   Computed 3D by Vconf -m prep SDfile
Find this compound or compounds like it in BindingDB:
Activity Spreadsheet -- Enzyme Inhibition Constant Data from BindingDB
Found 2 hits for monomerid = 40678
TargetProtein artemis(Homo sapiens (Human))
Burnham Center For Chemical Genomics
Curated by PubChem BioAssay
LigandPNGBDBM40678(2-(4-chloranyl-3,5-dimethyl-phenoxy)-N-(4-pyrrolid...)
Affinity DataIC50:  2.00E+4nM. Assay description: Data Source: Sanford-Burnham Center for Chemical Genomics (SBCCG) Source Affiliation: Sanford-Burnham Medical Research Institute (SBMRI, San Diego CA...
In DepthDetails PCBioAssay
TargetNuclear receptor subfamily 4 group A member 1(Homo sapiens (Human))
Burnham Center For Chemical Genomics
Curated by PubChem BioAssay
LigandPNGBDBM40678(2-(4-chloranyl-3,5-dimethyl-phenoxy)-N-(4-pyrrolid...)
Affinity DataIC50: >1.00E+5nM. Assay description: Sanford-Burnham Center for Chemical Genomics (SBCCG) Sanford-Burnham Medical Research Institute (San Diego, CA) NIH Molecular Libraries Screening Cen...
In DepthDetails PCBioAssay