BDBM406804 3-chloro-N-[2-(4-methyl-1,3-thiazol-2-yl)pyrrolo[2,1-f][1,2,4]triazin-4-yl]pyridin-4-amine::US10336761, Example 87
SMILES Cc1csc(n1)-c1nc(Nc2ccncc2Cl)c2cccn2n1
InChI Key InChIKey=LDSCHZSRQSLWQV-UHFFFAOYSA-N
Data  2 IC50
  Tab Delimited (TSV)   2D SDfile   Computed 3D by Vconf -m prep SDfile
Find this compound or compounds like it in BindingDB:
Activity Spreadsheet -- Enzyme Inhibition Constant Data from BindingDB
Found 2 hits for monomerid = 406804
TargetTGF-beta receptor type-2(Homo sapiens (Human))
Bristol-Myers Squibb
US Patent
LigandPNGBDBM406804(3-chloro-N-[2-(4-methyl-1,3-thiazol-2-yl)pyrrolo[2...)
Affinity DataIC50:  350nM. Assay description: Assays are conducted in 1536-well plates and 2 mL reactions are prepared from addition of HIS-TGFβR1 T204D or HIS-TGFβR2 WT, anti-HIS detec...
Ligand InfoPC cidPC sid
In DepthDetails US Patent
TargetTGF-beta receptor type-1(Homo sapiens (Human))
Bristol-Myers Squibb
US Patent
LigandPNGBDBM406804(3-chloro-N-[2-(4-methyl-1,3-thiazol-2-yl)pyrrolo[2...)
Affinity DataIC50:  0.920nM. Assay description: Assays are conducted in 1536-well plates and 2 mL reactions are prepared from addition of HIS-TGFβR1 T204D or HIS-TGFβR2 WT, anti-HIS detec...
Ligand InfoPC cidPC sid
In DepthDetails US Patent