BDBM40690 1-(2-chloro-5-nitro-phenyl)sulfonylisonipecotic acid [2-[(3,5-dichloro-2-pyridyl)amino]-2-keto-ethyl] ester::1-(2-chloro-5-nitrophenyl)sulfonyl-4-piperidinecarboxylic acid [2-[(3,5-dichloro-2-pyridinyl)amino]-2-oxoethyl] ester::MLS000536113::SMR000155443::[2-[(3,5-dichloropyridin-2-yl)amino]-2-oxoethyl] 1-(2-chloro-5-nitrophenyl)sulfonylpiperidine-4-carboxylate::[2-[[3,5-bis(chloranyl)pyridin-2-yl]amino]-2-oxidanylidene-ethyl] 1-(2-chloranyl-5-nitro-phenyl)sulfonylpiperidine-4-carboxylate::cid_4193266
SMILES [O-][N+](=O)c1ccc(Cl)c(c1)S(=O)(=O)N1CCC(CC1)C(=O)OCC(=O)Nc1ncc(Cl)cc1Cl
InChI Key InChIKey=CJMIAGMGAIOLBU-UHFFFAOYSA-N
Data  4 IC50
  Tab Delimited (TSV)   2D SDfile   Computed 3D by Vconf -m prep SDfile
Find this compound or compounds like it in BindingDB:
Activity Spreadsheet -- Enzyme Inhibition Constant Data from BindingDB
Found 4 hits for monomerid = 40690
TargetNuclear receptor subfamily 4 group A member 1(Homo sapiens (Human))
Burnham Center For Chemical Genomics
Curated by PubChem BioAssay
LigandPNGBDBM40690(1-(2-chloro-5-nitro-phenyl)sulfonylisonipecotic ac...)
Affinity DataIC50:  3.81E+3nM. Assay description: Sanford-Burnham Center for Chemical Genomics (SBCCG) Sanford-Burnham Medical Research Institute (San Diego, CA) NIH Molecular Libraries Screening Cen...
In DepthDetails PCBioAssay
TargetCarboxy-terminal domain RNA polymerase II polypeptide A small phosphatase 1(Homo sapiens (Human))
Burnham Center For Chemical Genomics
Curated by PubChem BioAssay
LigandPNGBDBM40690(1-(2-chloro-5-nitro-phenyl)sulfonylisonipecotic ac...)
Affinity DataIC50:  4.29E+3nM. Assay description: Data Source: Sanford-Burnham Center for Chemical Genomics (SBCCG) Source Affiliation: Sanford-Burnham Medical Research Institute (SBMRI, San Diego, C...
In DepthDetails PCBioAssay
TargetDNA dC->dU-editing enzyme APOBEC-3G(Homo sapiens (Human))
Burnham Center For Chemical Genomics
Curated by PubChem BioAssay
LigandPNGBDBM40690(1-(2-chloro-5-nitro-phenyl)sulfonylisonipecotic ac...)
Affinity DataIC50:  3.63E+4nMT: 2°C. Assay description: Data Source: Sanford-Burnham Center for Chemical Genomics (SBCCG) Source Affiliation: Sanford-Burnham Medical Research Institute (SBMRI, San Diego, C...
In DepthDetails PCBioAssay
TargetDNA dC->dU-editing enzyme APOBEC-3A(Homo sapiens (Human))
Burnham Center For Chemical Genomics
Curated by PubChem BioAssay
LigandPNGBDBM40690(1-(2-chloro-5-nitro-phenyl)sulfonylisonipecotic ac...)
Affinity DataIC50:  1.79E+4nMT: 2°C. Assay description: Data Source: Sanford-Burnham Center for Chemical Genomics (SBCCG) Source Affiliation: Sanford-Burnham Medical Research Institute (SBMRI, San Diego, C...
In DepthDetails PCBioAssay