BDBM406990 4-[({4-[(3-fluoropyridin-4-yl)amino]-2-(pyridin-2-yl)pyrrolo[2,1-f][1,2,4]triazin-5-yl}methyl)amino]butan-2-ol::US10336761, Example 274
SMILES CC(O)CCNCc1ccn2nc(nc(Nc3ccncc3F)c12)-c1ccccn1
InChI Key InChIKey=HJTMXUSRFLGCTK-UHFFFAOYSA-N
Data  2 IC50
  Tab Delimited (TSV)   2D SDfile   Computed 3D by Vconf -m prep SDfile
Find this compound or compounds like it in BindingDB:
Activity Spreadsheet -- Enzyme Inhibition Constant Data from BindingDB
Found 2 hits for monomerid = 406990
TargetTGF-beta receptor type-2(Homo sapiens (Human))
Bristol-Myers Squibb
US Patent
LigandPNGBDBM406990(4-[({4-[(3-fluoropyridin-4-yl)amino]-2-(pyridin-2-...)
Affinity DataIC50:  66nM. Assay description: Assays are conducted in 1536-well plates and 2 mL reactions are prepared from addition of HIS-TGFβR1 T204D or HIS-TGFβR2 WT, anti-HIS detec...
Ligand InfoPC cidPC sid
In DepthDetails US Patent
TargetTGF-beta receptor type-1(Homo sapiens (Human))
Bristol-Myers Squibb
US Patent
LigandPNGBDBM406990(4-[({4-[(3-fluoropyridin-4-yl)amino]-2-(pyridin-2-...)
Affinity DataIC50:  0.520nM. Assay description: Assays are conducted in 1536-well plates and 2 mL reactions are prepared from addition of HIS-TGFβR1 T204D or HIS-TGFβR2 WT, anti-HIS detec...
Ligand InfoPC cidPC sid
In DepthDetails US Patent