BDBM40763 Iminocyclitol, 6
SMILES CN1CC(NC(C)=O)C(O)C(O)C1CO
InChI Key InChIKey=VUPOCHJXEMUXQZ-UHFFFAOYSA-N
Data  1 KI
  Tab Delimited (TSV)   2D SDfile   Computed 3D by Vconf -m prep SDfile
Find this compound or compounds like it in BindingDB:
Activity Spreadsheet -- Enzyme Inhibition Constant Data from BindingDB
Found 1 hit for monomerid = 40763
TargetBeta-hexosaminidase subunit beta(Homo sapiens (Human))
The Scripps Research Institute
LigandPNGBDBM40763(Iminocyclitol, 6)
Affinity DataKi:  860nM. Assay description: Hexosaminidase activity assay was measured by fluorometry, VersaFluor Fluorometer from Bio-Rad.
In DepthDetails ArticlePubMed