BDBM408191 (S)-7-(1-(4-(pyrimidin-2-yl)piperazin-1-yl)ethyl)quinolone or (R)-7-(1-(4-(pyrimidin-2-yl)piperazin-1-yl)ethyl)quinoline::US10336775, Example 95
SMILES CC(N1CCN(CC1)c1ncccn1)c1ccc2cccnc2c1
InChI Key InChIKey=IVLDFSFMFHFSGH-UHFFFAOYSA-N
Data  1 IC50
  Tab Delimited (TSV)   2D SDfile   Computed 3D by Vconf -m prep SDfile
Find this compound or compounds like it in BindingDB:
Activity Spreadsheet -- Enzyme Inhibition Constant Data from BindingDB
Found 1 hit for monomerid = 408191
TargetProtein O-GlcNAcase(Homo sapiens (Human))
Asceneuron
US Patent
LigandPNGBDBM408191((S)-7-(1-(4-(pyrimidin-2-yl)piperazin-1-yl)ethyl)q...)
Affinity DataIC50:  125nM. Assay description: 5 μl of the appropriate concentration of a solution of inhibitor in McIlvaine's Buffer (pH 6.5) in 2% DMSO (for a dose response curve calcul...
Ligand InfoPC cidPC sid
In DepthDetails US Patent