BDBM408244 1-(2-(4-((S)-1-(benzo[d][1,3]dioxol-5-yl)ethyl)piperazin-1-yl)pyrimidin-5-yl)ethan-1-ol::US10336775, Example 168::US11046712, No 168
SMILES CC(O)c1cnc(nc1)N1CCN(CC1)C(C)c1ccc2OCOc2c1
InChI Key InChIKey=KHDFKAZUUHISJB-UHFFFAOYSA-N
Data  2 IC50
  Tab Delimited (TSV)   2D SDfile   Computed 3D by Vconf -m prep SDfile
Find this compound or compounds like it in BindingDB:
Activity Spreadsheet -- Enzyme Inhibition Constant Data from BindingDB
Found 2 hits for monomerid = 408244
TargetProtein O-GlcNAcase(Homo sapiens (Human))
Asceneuron
US Patent
LigandPNGBDBM408244(1-(2-(4-((S)-1-(benzo[d][1,3]dioxol-5-yl)ethyl)pip...)
Affinity DataIC50: <50nM. Assay description: 5 μI of the appropriate concentration of a solution of inhibitor in McIlvaine's Buffer (pH 6.5) in 2% DMSO (for a dose response curve calcul...
Ligand InfoPC cidPC sid
In DepthDetails US Patent
TargetProtein O-GlcNAcase(Homo sapiens (Human))
Asceneuron
US Patent
LigandPNGBDBM408244(1-(2-(4-((S)-1-(benzo[d][1,3]dioxol-5-yl)ethyl)pip...)
Affinity DataIC50: <50nM. Assay description: 5 μl of the appropriate concentration of a solution of inhibitor in McIlvaine's Buffer (pH 6.5) in 2% DMSO (for a dose response curve calcul...
Ligand InfoPC cidPC sid
In DepthDetails US Patent