BDBM408248 6-(1-(4-(5-fluoropyrimidin-2-yl)piperazin-1-yl)ethyl)quinoxaline::US10336775, Example 172::US11046712, No 172
SMILES CC(N1CCN(CC1)c1ncc(F)cn1)c1ccc2nccnc2c1
InChI Key InChIKey=FUSNMHGIRSETTH-UHFFFAOYSA-N
Data  2 IC50
  Tab Delimited (TSV)   2D SDfile   Computed 3D by Vconf -m prep SDfile
Find this compound or compounds like it in BindingDB:
Activity Spreadsheet -- Enzyme Inhibition Constant Data from BindingDB
Found 2 hits for monomerid = 408248
TargetProtein O-GlcNAcase(Homo sapiens (Human))
Asceneuron
US Patent
LigandPNGBDBM408248(6-(1-(4-(5-fluoropyrimidin-2-yl)piperazin-1-yl)eth...)
Affinity DataIC50:  125nM. Assay description: 5 μI of the appropriate concentration of a solution of inhibitor in McIlvaine's Buffer (pH 6.5) in 2% DMSO (for a dose response curve calcul...
Ligand InfoPC cidPC sid
In DepthDetails US Patent
TargetProtein O-GlcNAcase(Homo sapiens (Human))
Asceneuron
US Patent
LigandPNGBDBM408248(6-(1-(4-(5-fluoropyrimidin-2-yl)piperazin-1-yl)eth...)
Affinity DataIC50:  125nM. Assay description: 5 μl of the appropriate concentration of a solution of inhibitor in McIlvaine's Buffer (pH 6.5) in 2% DMSO (for a dose response curve calcul...
Ligand InfoPC cidPC sid
In DepthDetails US Patent