BDBM408268 (S)-1-(1-(benzo[d][1,3]dioxol-5-yl)ethyl)-4-(5-(methylthio)pyridin-2-yl)piperazine::US10336775, Example 192::US11046712, No 192
SMILES CSc1ccc(nc1)N1CCN(CC1)[C@@H](C)c1ccc2OCOc2c1
InChI Key InChIKey=VQPUBZMEWOBKSX-AWEZNQCLSA-N
Data  2 IC50
  Tab Delimited (TSV)   2D SDfile   Computed 3D by Vconf -m prep SDfile
Find this compound or compounds like it in BindingDB:
Activity Spreadsheet -- Enzyme Inhibition Constant Data from BindingDB
Found 2 hits for monomerid = 408268
TargetProtein O-GlcNAcase(Homo sapiens (Human))
Asceneuron
US Patent
LigandPNGBDBM408268((S)-1-(1-(benzo[d][1,3]dioxol-5-yl)ethyl)-4-(5-(me...)
Affinity DataIC50: <50nM. Assay description: 5 μI of the appropriate concentration of a solution of inhibitor in McIlvaine's Buffer (pH 6.5) in 2% DMSO (for a dose response curve calcul...
Ligand InfoPC cidPC sid
In DepthDetails US Patent
TargetProtein O-GlcNAcase(Homo sapiens (Human))
Asceneuron
US Patent
LigandPNGBDBM408268((S)-1-(1-(benzo[d][1,3]dioxol-5-yl)ethyl)-4-(5-(me...)
Affinity DataIC50: <50nM. Assay description: 5 μl of the appropriate concentration of a solution of inhibitor in McIlvaine's Buffer (pH 6.5) in 2% DMSO (for a dose response curve calcul...
Ligand InfoPC cidPC sid
In DepthDetails US Patent