BDBM408635 US10376502, Entry 3
SMILES CC(C)(C)C(=O)N(CCCCCCN1C[C@H](O)[C@@H](O)[C@H](O)[C@H]1CO)C1CCCCC1
InChI Key InChIKey=DWMQGQSPNDGKJC-PLACYPQZSA-N
Data  1 EC50
  Tab Delimited (TSV)   2D SDfile   Computed 3D by Vconf -m prep SDfile
Find this compound or compounds like it in BindingDB:
Activity Spreadsheet -- Enzyme Inhibition Constant Data from BindingDB
Found 1 hit for monomerid = 408635
TargetGenome polyprotein(Bovine viral diarrhea virus (isolate NADL) (BVDV) ...)
TBA
US Patent
LigandPNGBDBM408635(US10376502, Entry 3)
Affinity DataEC50:  200nM. Assay description: To evaluate antiviral activity against BVDV, a single cycle virus yield reduction assay was performed in the presence of from 0.16 μM to 100 ...
In DepthDetails US Patent