BDBM408686 N-[(2,6-difluorophenyl)methyl]-1-({4-[(4-methylpyrazol-1-yl)methyl]phenyl}methyl)-::US10364238, Example 13
SMILES Cc1cn(Cc2c(F)cccc2F)nc1Cc1ccc(CNC(=O)c2c[nH]nc2C(F)(F)F)cc1
InChI Key InChIKey=ACQZFDIAYFYJLE-UHFFFAOYSA-N
Data  2 IC50
  Tab Delimited (TSV)   2D SDfile   Computed 3D by Vconf -m prep SDfile
Find this compound or compounds like it in BindingDB:
Activity Spreadsheet -- Enzyme Inhibition Constant Data from BindingDB
Found 2 hits for monomerid = 408686
TargetKallikrein-1(Homo sapiens (Human))
Kalvista Pharmaceuticals
US Patent
LigandPNGBDBM408686(N-[(2,6-difluorophenyl)methyl]-1-({4-[(4-methylpyr...)
Affinity DataIC50: >1.00E+4nM. Assay description: KLK1 inhibitory activity in vitro was determined using standard published methods. Human KLK1 (Callbiochem) was incubated at 25° C. with the fluorog...
Ligand InfoPC cidPC sid
In DepthDetails US Patent
TargetPlasma kallikrein(Homo sapiens (Human))
Kalvista Pharmaceuticals
US Patent
LigandPNGBDBM408686(N-[(2,6-difluorophenyl)methyl]-1-({4-[(4-methylpyr...)
Affinity DataIC50:  439nM. Assay description: Plasma kallikrein inhibitory activity in vitro was determined using standard published methods. Human plasma kallikrein (Protogen) was incubated at 2...
Ligand InfoPC cidPC sid
In DepthDetails US Patent