BDBM408703 US10358436, Example A119
SMILES COc1ccc2NC(=O)[C@@]3(CC3c3ccc4c(n[nH]c4c3)-c3ccc(cc3)N3CCC(CC3)N(C)C)c2c1
InChI Key
Data  3 IC50
  Tab Delimited (TSV)   2D SDfile   Computed 3D by Vconf -m prep SDfile
Find this compound or compounds like it in BindingDB:
Activity Spreadsheet -- Enzyme Inhibition Constant Data from BindingDB
Found 3 hits for monomerid = 408703
TargetSerine/threonine-protein kinase PLK4 [1-391](Homo sapiens (Human))
University Health Network
US Patent
LigandPNGBDBM408703(US10358436, Example A119)
Affinity DataIC50: <100nM. Assay description: Active PLK4 was purified from an E. coli expression system as an amino terminal GST fusion of residues 1-391 of human PLK4. The protein was purified ...
Ligand InfoPC cidPC sid
In DepthDetails US Patent
TargetAurora kinase B(Homo sapiens (Human))
University Health Network
US Patent
LigandPNGBDBM408703(US10358436, Example A119)
Affinity DataIC50: <100nM. Assay description: Aurora B inhibition was determined using the Z-Lyte assay kit from Invitrogen. The assay was performed using the recommended manufacturer's instr...
Ligand InfoPC cidPC sid
In DepthDetails US Patent
TargetAurora kinase A(Homo sapiens (Human))
University Health Network
US Patent
LigandPNGBDBM408703(US10358436, Example A119)
Affinity DataIC50: >500nM. Assay description: Aurora A inhibition was determined using the Z-Lyte assay kit from Invitrogen. The assay was performed using the recommended manufacturer's instr...
Ligand InfoPC cidPC sid
In DepthDetails US Patent