BDBM408736 N-[(2-fluoro-3,6-dimethoxyphenyl)methyl]-3-(methoxymethyl)-1-({4-[(2-oxopyridin- 1-yl)methyl]phenyl}methyl)pyrazole-4-carboxamide ::US10364238, Example 54::US11001578, Example 54::US11084809, Example 54::US11198691, Example 54
SMILES COCc1nn(Cc2ccc(Cn3ccccc3=O)cc2)cc1C(=O)NCc1c(OC)ccc(OC)c1F
InChI Key InChIKey=TVHOOPXMFWZGQK-UHFFFAOYSA-N
Data  8 IC50
  Tab Delimited (TSV)   2D SDfile   Computed 3D by Vconf -m prep SDfile
Find this compound or compounds like it in BindingDB:
Activity Spreadsheet -- Enzyme Inhibition Constant Data from BindingDB
Found 9 hits for monomerid = 408736
TargetPlasma kallikrein(Homo sapiens (Human))
Kalvista Pharmaceuticals
US Patent
LigandPNGBDBM408736( N-[(2-fluoro-3,6-dimethoxyphenyl)methyl]-3-(metho...)
Affinity DataIC50:  2.10nM. Assay description: Plasma kallikrein inhibitory activity in vitro was determined using standard published methods. Human plasma kallikrein (Protogen) was incubated at 2...
Ligand InfoPC cidPC sid
In DepthDetails US Patent
TargetKallikrein-1(Homo sapiens (Human))
Kalvista Pharmaceuticals
US Patent
LigandPNGBDBM408736( N-[(2-fluoro-3,6-dimethoxyphenyl)methyl]-3-(metho...)
Affinity DataIC50: >4.00E+4nM. Assay description: KLK1 inhibitory activity in vitro was determined using standard published methods. Human KLK1 (Callbiochem) was incubated at 25° C. with the fluorog...
Ligand InfoPC cidPC sid
In DepthDetails US Patent
TargetPlasma kallikrein(Homo sapiens (Human))
Kalvista Pharmaceuticals
US Patent
LigandPNGBDBM408736( N-[(2-fluoro-3,6-dimethoxyphenyl)methyl]-3-(metho...)
Affinity DataIC50:  2.10nM. Assay description: Plasma kallikrein inhibitory activity in vitro was determined using standard published methods (see e.g. Johansen et al., Int. J. Tiss. Reac. 1986, 8...
Ligand InfoPC cidPC sid
In DepthDetails US Patent
TargetKallikrein-1(Homo sapiens (Human))
Kalvista Pharmaceuticals
US Patent
LigandPNGBDBM408736( N-[(2-fluoro-3,6-dimethoxyphenyl)methyl]-3-(metho...)
Affinity DataIC50: >4.00E+4nM. Assay description: KLK1 inhibitory activity in vitro was determined using standard published methods (see e.g. Johansen et al., Int. J. Tiss. Reac. 1986, 8, 185; Shori ...
Ligand InfoPC cidPC sid
In DepthDetails US Patent
TargetPlasma kallikrein(Homo sapiens (Human))
Kalvista Pharmaceuticals
US Patent
LigandPNGBDBM408736( N-[(2-fluoro-3,6-dimethoxyphenyl)methyl]-3-(metho...)
Affinity DataIC50:  2.10nM
Ligand InfoPC cidPC sid
In DepthDetails
TargetKallikrein-1(Homo sapiens (Human))
Kalvista Pharmaceuticals
US Patent
LigandPNGBDBM408736( N-[(2-fluoro-3,6-dimethoxyphenyl)methyl]-3-(metho...)
Affinity DataIC50: >4.00E+4nM. Assay description: KLK1 inhibitory activity in vitro was determined using standard published methods (see e.g. Johansen et al., Int. J. Tiss. Reac. 1986, 8, 185; Shori ...
Ligand InfoPC cidPC sid
In DepthDetails US Patent
TargetPlasma kallikrein(Homo sapiens (Human))
Kalvista Pharmaceuticals
US Patent
LigandPNGBDBM408736( N-[(2-fluoro-3,6-dimethoxyphenyl)methyl]-3-(metho...)
Affinity DataIC50:  2.10nM. Assay description: KLK1 inhibitory activity in vitro was determined using standard published methods. Human KLK1 (Callbiochem) was incubated at 25° C. with the fluoroge...
Ligand InfoPC cidPC sid
In DepthDetails US Patent
TargetKallikrein-1(Homo sapiens (Human))
Kalvista Pharmaceuticals
US Patent
LigandPNGBDBM408736( N-[(2-fluoro-3,6-dimethoxyphenyl)methyl]-3-(metho...)
Affinity DataIC50: >4.00E+4nM. Assay description: Plasma kallikrein inhibitory activity in vitro was determined using standard published methods. Human plasma kallikrein (Protogen) was incubated at 2...
Ligand InfoPC cidPC sid
In DepthDetails US Patent
TargetPlasma kallikrein(Homo sapiens (Human))
Kalvista Pharmaceuticals
US Patent
LigandPNGBDBM408736( N-[(2-fluoro-3,6-dimethoxyphenyl)methyl]-3-(metho...)
Affinity DataIC50:  2.10nM. Assay description: Plasma kallikrein inhibitory activity in vitro was determined using standard published methods (see e.g. Johansen et al., Int. J. Tiss. Reac. 1986, 8...
Ligand InfoPC cidPC sid
In DepthDetails US Patent