BDBM408971 1-(N-((trans-4-(4-Methoxy-3-methylphenyl)cyclohexyl)methyl)-3,3-dimethylbutanamido)isoquinoline-6-carboxylic Acid::US10377717, Compound 100
SMILES COc1ccc(cc1C)[C@H]1CC[C@H](CN(C(=O)CC(C)(C)C)c2nccc3cc(ccc23)C(O)=O)CC1
InChI Key InChIKey=HCTGAWJEMNVLBD-HZCBDIJESA-N
Data  1 EC50
  Tab Delimited (TSV)   2D SDfile   Computed 3D by Vconf -m prep SDfile
Find this compound or compounds like it in BindingDB:
Activity Spreadsheet -- Enzyme Inhibition Constant Data from BindingDB
Found 1 hit for monomerid = 408971
TargetBile acid receptor(Homo sapiens (Human))
Metacrine
US Patent
LigandPNGBDBM408971(1-(N-((trans-4-(4-Methoxy-3-methylphenyl)cyclohexy...)
Affinity DataEC50:  5.50E+3nM. Assay description: SeedingCV-1 cells were seeded at a density of 2,000,000 cells in a T175 flask with DMEM+10% charcoal double-stripped FBS and incubated at 37° C. in 5...
Ligand InfoPC cidPC sid
In DepthDetails US Patent