BDBM40898 4-chloranyl-3-(propan-2-ylsulfamoyl)benzoic acid::4-chloro-3-(isopropylsulfamoyl)benzoic acid::4-chloro-3-(propan-2-ylsulfamoyl)benzoic acid::4-chloro-3-[(isopropylamino)sulfonyl]benzoic acid::MLS000064270::SMR000076333::cid_974897
SMILES CC(C)NS(=O)(=O)c1cc(ccc1Cl)C(O)=O
InChI Key InChIKey=ZQUIOPNEGHXHCB-UHFFFAOYSA-N
Data  1 IC50
  Tab Delimited (TSV)   2D SDfile   Computed 3D by Vconf -m prep SDfile
Find this compound or compounds like it in BindingDB:
Activity Spreadsheet -- Enzyme Inhibition Constant Data from BindingDB
Found 1 hit for monomerid = 40898
TargetComplement C1s subcomponent(Homo sapiens (Human))
Pcmd
Curated by PubChem BioAssay
LigandPNGBDBM40898(4-chloranyl-3-(propan-2-ylsulfamoyl)benzoic acid |...)
Affinity DataIC50: >5.00E+4nM. Assay description: Molecular Library Screening Center Network (MLSCN) Penn Center for Molecular Discovery (PCMD) Assay Provider: Dr. Scott L. Diamond, University of Pen...
In DepthDetails PCBioAssay