BDBM409275 2-[6-(4-Fluoro-3-methyl-phenyl)pyrrolo[3,2-b]pyridin-1-yl]-N,N-::US10377753, Example 175::US10377753, Example 610
SMILES CN(C)C(=O)Cn1ccc2ncc(cc12)-c1ccc(F)c(C)c1
InChI Key InChIKey=ISGNQURUMOYRMQ-UHFFFAOYSA-N
Data  2 KI  11 IC50
  Tab Delimited (TSV)   2D SDfile   Computed 3D by Vconf -m prep SDfile
Find this compound or compounds like it in BindingDB:
Activity Spreadsheet -- Enzyme Inhibition Constant Data from BindingDB
Found 13 hits for monomerid = 409275
TargetGlutamate receptor ionotropic, NMDA 2B(Rattus norvegicus (Rat))
Janssen Research & Development
Curated by ChEMBL
LigandPNGBDBM409275(2-[6-(4-Fluoro-3-methyl-phenyl)pyrrolo[3,2-b]pyrid...)
Affinity DataKi:  11nM. Assay description: Displacement of [3H]-1-(azetidin-1-yl)-2-(6-(4-fluoro-3-methylphenyl)-1H-pyrrolo[3,2-b]pyridin-1-yl)ethanone from rat adult cortex GluN2B receptor me...
Ligand InfoPC cidPC sid
In DepthDetails ArticlePubMed
TargetPotassium voltage-gated channel subfamily H member 2(Homo sapiens (Human))
Janssen Research & Development
Curated by ChEMBL
LigandPNGBDBM409275(2-[6-(4-Fluoro-3-methyl-phenyl)pyrrolo[3,2-b]pyrid...)
Affinity DataKi:  5.90E+3nM. Assay description: Displacement of [3H]dofetilide from recombinant human ERG expressed in HEK293 cell membranes measured after 80 mins by TopCount scintillation analysi...
Ligand InfoPC cidPC sid
In DepthDetails ArticlePubMed
TargetGlutamate receptor ionotropic, NMDA 2B(Homo sapiens (Human))
Janssen Pharmaceutica
US Patent
LigandPNGBDBM409275(2-[6-(4-Fluoro-3-methyl-phenyl)pyrrolo[3,2-b]pyrid...)
Affinity DataIC50:  2nM. Assay description: The assay depends on the binding of a tracer to the GluN2B subunit-containing NMDA receptors and the ability of the test compounds to displace such b...
Ligand InfoPC cidPC sid
In DepthDetails US Patent
TargetCytochrome P450 3A4(Homo sapiens (Human))
Janssen Research & Development
Curated by ChEMBL
LigandPNGBDBM409275(2-[6-(4-Fluoro-3-methyl-phenyl)pyrrolo[3,2-b]pyrid...)
Affinity DataIC50: >1.00E+4nM. Assay description: Inhibition of CYP3A4 in human liver microsomes
Ligand InfoPC cidPC sid
In DepthDetails ArticlePubMed
TargetCytochrome P450 2C9(Homo sapiens (Human))
Janssen Research & Development
Curated by ChEMBL
LigandPNGBDBM409275(2-[6-(4-Fluoro-3-methyl-phenyl)pyrrolo[3,2-b]pyrid...)
Affinity DataIC50: >1.00E+4nM. Assay description: Inhibition of CYP2C9 in human liver microsomes
Ligand InfoPC cidPC sid
In DepthDetails ArticlePubMed
TargetPotassium voltage-gated channel subfamily H member 2(Homo sapiens (Human))
Janssen Research & Development
Curated by ChEMBL
LigandPNGBDBM409275(2-[6-(4-Fluoro-3-methyl-phenyl)pyrrolo[3,2-b]pyrid...)
Affinity DataIC50: >1.00E+4nM. Assay description: Inhibition of human ERG expressed in CHO cells measured after 5 mins by Qpatch method
Ligand InfoPC cidPC sid
In DepthDetails ArticlePubMed
TargetCytochrome P450 2C8(Homo sapiens (Human))
Janssen Research & Development
Curated by ChEMBL
LigandPNGBDBM409275(2-[6-(4-Fluoro-3-methyl-phenyl)pyrrolo[3,2-b]pyrid...)
Affinity DataIC50: >1.00E+4nM. Assay description: Inhibition of CYP2C8 in human liver microsomes
Ligand InfoPC cidPC sid
In DepthDetails ArticlePubMed
TargetGlutamate receptor ionotropic, NMDA 1/2B(Homo sapiens (Human))
Janssen Research & Development
Curated by ChEMBL
LigandPNGBDBM409275(2-[6-(4-Fluoro-3-methyl-phenyl)pyrrolo[3,2-b]pyrid...)
Affinity DataIC50:  25nM. Assay description: Negative allosteric modulation of recombinant human GluN1a/GluN2B expressed in CHO-T-REx cells assessed as inhibition of glutamate/glycine-induced re...
Ligand InfoPC cidPC sid
In DepthDetails ArticlePubMed
TargetCytochrome P450 1A2(Homo sapiens (Human))
Janssen Research & Development
Curated by ChEMBL
LigandPNGBDBM409275(2-[6-(4-Fluoro-3-methyl-phenyl)pyrrolo[3,2-b]pyrid...)
Affinity DataIC50: >1.00E+4nM. Assay description: Inhibition of CYP1A2 in human liver microsomes
Ligand InfoPC cidPC sid
In DepthDetails ArticlePubMed
TargetCytochrome P450 2C19(Homo sapiens (Human))
Janssen Research & Development
Curated by ChEMBL
LigandPNGBDBM409275(2-[6-(4-Fluoro-3-methyl-phenyl)pyrrolo[3,2-b]pyrid...)
Affinity DataIC50: >1.00E+4nM. Assay description: Inhibition of CYP2C19 in human liver microsomes
Ligand InfoPC cidPC sid
In DepthDetails ArticlePubMed
TargetGlutamate receptor ionotropic, NMDA 1/2B(Homo sapiens (Human))
Janssen Research & Development
Curated by ChEMBL
LigandPNGBDBM409275(2-[6-(4-Fluoro-3-methyl-phenyl)pyrrolo[3,2-b]pyrid...)
Affinity DataIC50:  2nM. Assay description: Modulation of recombinant human GluN1/GluN2B NMDA receptor expressed in mammalian cells assessed as inhibition of glutamate/glycine-induced intracell...
Ligand InfoPC cidPC sid
In DepthDetails ArticlePubMed
TargetGlutamate receptor ionotropic, NMDA 2B(Homo sapiens (Human))
Janssen Pharmaceutica
US Patent
LigandPNGBDBM409275(2-[6-(4-Fluoro-3-methyl-phenyl)pyrrolo[3,2-b]pyrid...)
Affinity DataIC50:  501nM. Assay description: The assay depends on the binding of a tracer to the GluN2B subunit-containing NMDA receptors and the ability of the test compounds to displace such b...
Ligand InfoPC cidPC sid
In DepthDetails US Patent
TargetCytochrome P450 2D6(Homo sapiens (Human))
Janssen Research & Development
Curated by ChEMBL
LigandPNGBDBM409275(2-[6-(4-Fluoro-3-methyl-phenyl)pyrrolo[3,2-b]pyrid...)
Affinity DataIC50: >1.00E+4nM. Assay description: Inhibition of CYP2D6 in human liver microsomes
Ligand InfoPC cidPC sid
In DepthDetails ArticlePubMed