BDBM409779 US10370333, Example II-2
SMILES COc1ccc(cc1S(=O)(=O)Nc1cnc2ccccc2c1)C(F)(F)F
InChI Key InChIKey=HZMIGXHURLBNOL-UHFFFAOYSA-N
Data  3 IC50
  Tab Delimited (TSV)   2D SDfile   Computed 3D by Vconf -m prep SDfile
Find this compound or compounds like it in BindingDB:
Activity Spreadsheet -- Enzyme Inhibition Constant Data from BindingDB
Found 3 hits for monomerid = 409779
TargetAlkaline phosphatase, tissue-nonspecific isozyme(Homo sapiens (Human))
Sanford-Burnham Prebys Medical Discovery Institute
US Patent
LigandPNGBDBM409779(US10370333, Example II-2)
Affinity DataIC50:  550nM. Assay description: To determine the inhibition selectivity for inhibitor candidates, human TNAP, PLAP or IAP were added to microtiter plates followed by addition of the...
Ligand InfoPC cidPC sid
In DepthDetails US Patent
TargetAlkaline phosphatase, tissue-nonspecific isozyme(Homo sapiens (Human))
Sanford-Burnham Prebys Medical Discovery Institute
US Patent
LigandPNGBDBM409779(US10370333, Example II-2)
Affinity DataIC50:  26nM. Assay description: Inhibition of TNAP (unknown origin) using PPi as substrate
Ligand InfoPC cidPC sid
In DepthDetails ArticlePubMed
TargetAlkaline phosphatase, tissue-nonspecific isozyme(Homo sapiens (Human))
Sanford-Burnham Prebys Medical Discovery Institute
US Patent
LigandPNGBDBM409779(US10370333, Example II-2)
Affinity DataIC50: >2.00E+4nM. Assay description: Inhibition of TNAP (unknown origin) in whole blood using pNPP as substrate
Ligand InfoPC cidPC sid
In DepthDetails ArticlePubMed