BDBM409793 US10370333, Example III-10
SMILES COc1ccc(OC)c(c1)S(=O)(=O)Nc1cncc(c1)-c1ccc(C)cc1
InChI Key InChIKey=SHSKEELRSJEFMV-UHFFFAOYSA-N
Data  1 IC50
  Tab Delimited (TSV)   2D SDfile   Computed 3D by Vconf -m prep SDfile
Find this compound or compounds like it in BindingDB:
Activity Spreadsheet -- Enzyme Inhibition Constant Data from BindingDB
Found 1 hit for monomerid = 409793
TargetAlkaline phosphatase, tissue-nonspecific isozyme(Homo sapiens (Human))
Sanford-Burnham Prebys Medical Discovery Institute
US Patent
LigandPNGBDBM409793(US10370333, Example III-10)
Affinity DataIC50: >1.00E+3nM. Assay description: To determine the inhibition selectivity for inhibitor candidates, human TNAP, PLAP or IAP were added to microtiter plates followed by addition of the...
Ligand InfoPC cidPC sid
In DepthDetails US Patent