BDBM409884 US10370333, Example IX-12
SMILES CCCNC(=O)c1ccc2ncc(NS(=O)(=O)c3cc(OC)ccc3OC)cc2c1
InChI Key InChIKey=HLIZAMFHEFBVBW-UHFFFAOYSA-N
Data  1 IC50
  Tab Delimited (TSV)   2D SDfile   Computed 3D by Vconf -m prep SDfile
Find this compound or compounds like it in BindingDB:
Activity Spreadsheet -- Enzyme Inhibition Constant Data from BindingDB
Found 1 hit for monomerid = 409884
TargetAlkaline phosphatase, tissue-nonspecific isozyme(Homo sapiens (Human))
Sanford-Burnham Prebys Medical Discovery Institute
US Patent
LigandPNGBDBM409884(US10370333, Example IX-12)
Affinity DataIC50:  550nM. Assay description: To determine the inhibition selectivity for inhibitor candidates, human TNAP, PLAP or IAP were added to microtiter plates followed by addition of the...
Ligand InfoPC cidPC sid
In DepthDetails US Patent