BDBM409945 US10370333, Example XII-20
SMILES CNC(=O)c1cncc(NS(=O)(=O)c2cc(OC(F)(F)F)ccc2OC)c1
InChI Key InChIKey=OVBIJEVBNMGFEA-UHFFFAOYSA-N
Data  1 IC50
  Tab Delimited (TSV)   2D SDfile   Computed 3D by Vconf -m prep SDfile
Find this compound or compounds like it in BindingDB:
Activity Spreadsheet -- Enzyme Inhibition Constant Data from BindingDB
Found 1 hit for monomerid = 409945
TargetAlkaline phosphatase, tissue-nonspecific isozyme(Homo sapiens (Human))
Sanford-Burnham Prebys Medical Discovery Institute
US Patent
LigandPNGBDBM409945(US10370333, Example XII-20)
Affinity DataIC50:  550nM. Assay description: To determine the inhibition selectivity for inhibitor candidates, human TNAP, PLAP or IAP were added to microtiter plates followed by addition of the...
Ligand InfoPC cidPC sid
In DepthDetails US Patent