BDBM410000 US10370339, Example 2-7
SMILES COC(=O)c1cc2nc(Nc3ccc(OC(F)(F)F)cc3)n([C@@H]3C[C@H](C)CC[C@H]3C(C)C)c2cc1OC
InChI Key InChIKey=YRPARRRJFCYHBG-GTCCEBARSA-N
Data  1 IC50
  Tab Delimited (TSV)   2D SDfile   Computed 3D by Vconf -m prep SDfile
Find this compound or compounds like it in BindingDB:
Activity Spreadsheet -- Enzyme Inhibition Constant Data from BindingDB
Found 1 hit for monomerid = 410000
TargetIsocitrate dehydrogenase [NADP] cytoplasmic [R132H](Homo sapiens (Human))
Bayer Pharma Aktiengesellschaft
US Patent
LigandPNGBDBM410000(US10370339, Example 2-7)
Affinity DataIC50:  100nM. Assay description: Mutant IDH1 R132H Biochemical Assay mIDH1 catalyzes the NADPH-dependent reduction of alpha-ketoglutarate (a-KG) to (2R)-2-hydroxyglutarate (2-HG). NA...
Ligand InfoPC cidPC sid
In DepthDetails US Patent