BDBM410035 US10370339, Example 2-42
SMILES CC(C)Oc1ccc(Nc2nc3cc(CCC(O)=O)ccc3n2[C@@H]2C[C@H](C)CC[C@H]2C(C)C)cc1
InChI Key InChIKey=ZZTIQCGBQGBOBW-WMVAVLGLSA-N
Data  1 IC50
  Tab Delimited (TSV)   2D SDfile   Computed 3D by Vconf -m prep SDfile
Find this compound or compounds like it in BindingDB:
Activity Spreadsheet -- Enzyme Inhibition Constant Data from BindingDB
Found 1 hit for monomerid = 410035
TargetIsocitrate dehydrogenase [NADP] cytoplasmic [R132H](Homo sapiens (Human))
Bayer Pharma Aktiengesellschaft
US Patent
LigandPNGBDBM410035(US10370339, Example 2-42)
Affinity DataIC50:  12nM. Assay description: Mutant IDH1 R132H Biochemical Assay mIDH1 catalyzes the NADPH-dependent reduction of alpha-ketoglutarate (a-KG) to (2R)-2-hydroxyglutarate (2-HG). NA...
Ligand InfoPC cidPC sid
In DepthDetails US Patent