BDBM410180 US10370375, Example 28
SMILES CNS(=O)(=O)C[C@H]1CCC(CC1)N(C)c1ncnn2cccc12
InChI Key InChIKey=UXRNDJLQEYWKJP-CZLNCXOFSA-N
Data  3 IC50
  Tab Delimited (TSV)   2D SDfile   Computed 3D by Vconf -m prep SDfile
Find this compound or compounds like it in BindingDB:
Activity Spreadsheet -- Enzyme Inhibition Constant Data from BindingDB
Found 3 hits for monomerid = 410180
TargetTyrosine-protein kinase JAK1 [866-1154](Homo sapiens (Human))
Elanco Tiergesundheit
US Patent
LigandPNGBDBM410180(US10370375, Example 28)
Affinity DataIC50:  550nM. Assay description: All four kinases of the JAK/TYK-kinase family were used as purified recombinant GST-fusion proteins, containing the active kinase domains. GST-JAK1(8...
Ligand InfoPC cidPC sid
In DepthDetails US Patent
TargetNon-receptor tyrosine-protein kinase TYK2 [888-1187](Homo sapiens (Human))
Elanco Tiergesundheit
US Patent
LigandPNGBDBM410180(US10370375, Example 28)
Affinity DataIC50:  3.20E+3nM. Assay description: All four kinases of the JAK/TYK-kinase family were used as purified recombinant GST-fusion proteins, containing the active kinase domains. GST-JAK1(8...
Ligand InfoPC cidPC sid
In DepthDetails US Patent
TargetTyrosine-protein kinase JAK3 [811-1124](Homo sapiens (Human))
Elanco Tiergesundheit
US Patent
LigandPNGBDBM410180(US10370375, Example 28)
Affinity DataIC50: >1.00E+4nM. Assay description: All four kinases of the JAK/TYK-kinase family were used as purified recombinant GST-fusion proteins, containing the active kinase domains. GST-JAK1(8...
Ligand InfoPC cidPC sid
In DepthDetails US Patent