BDBM410193 US10370379, Compound 10::US11059827, Compound 10
SMILES F[C@H]1C[C@@H](N(C1)c1ccn2ncc(C#N)c2n1)c1cc(F)cnc1Cl
InChI Key InChIKey=UZQPIAOTXQCZIP-WCQYABFASA-N
Data  2 IC50
  Tab Delimited (TSV)   2D SDfile   Computed 3D by Vconf -m prep SDfile
Find this compound or compounds like it in BindingDB:
Activity Spreadsheet -- Enzyme Inhibition Constant Data from BindingDB
Found 2 hits for monomerid = 410193
TargetHigh affinity nerve growth factor receptor(Homo sapiens (Human))
Blueprint Medicines
US Patent
LigandPNGBDBM410193(US10370379, Compound 10 | US11059827, Compound 10)
Affinity DataIC50: <100nM. Assay description: In each well of a 384-well plate, 1 nM-1.5 nM of wild type NTRK1 enzyme (BPS Bioscience; 40280) was incubated in a total of 12.5 μL of buffer (1...
Ligand InfoPC cidPC sid
In DepthDetails US Patent
TargetHigh affinity nerve growth factor receptor(Homo sapiens (Human))
Blueprint Medicines
US Patent
LigandPNGBDBM410193(US10370379, Compound 10 | US11059827, Compound 10)
Affinity DataIC50: <10nM. Assay description: In each well of a 384-well plate, 1 nM-1.5 nM of wild type NTRK1 enzyme (BPS Bioscience; 40280) was incubated in a total of 12.5 μL of buffer (1...
Ligand InfoPC cidPC sid
In DepthDetails US Patent