BDBM410848 US10383880, Example 61
SMILES CS(=O)(=O)N(CC(O)Cn1c2ccccc2c2ccccc12)C1CCc2ccccc12
InChI Key InChIKey=IMPRKUKNKCCMEA-UHFFFAOYSA-N
Data  1 EC50
  Tab Delimited (TSV)   2D SDfile   Computed 3D by Vconf -m prep SDfile
Find this compound or compounds like it in BindingDB:
Activity Spreadsheet -- Enzyme Inhibition Constant Data from BindingDB
Found 1 hit for monomerid = 410848
TargetPeriod circadian protein homolog 2(Homo sapiens (Human))
Synchronicity
US Patent
LigandPNGBDBM410848(US10383880, Example 61)
Affinity DataEC50:  4.47E+3nM. Assay description: Per2 Assay for Evaluating the Potency of Test Compounds.
Ligand InfoPC cidPC sid
In DepthDetails US Patent