BDBM410911 N-[4-(2-Methoxy-phenyl)-pyridin-3-yl]-N-methyl-3,5-bis-trifluoromethyl-benzamide::US10385022, Example 29
SMILES COc1ccccc1-c1ccncc1N(C)C(=O)c1cc(cc(c1)C(F)(F)F)C(F)(F)F
InChI Key InChIKey=RAJXVTLMSAZTFF-UHFFFAOYSA-N
Data  1 EC50
  Tab Delimited (TSV)   2D SDfile   Computed 3D by Vconf -m prep SDfile
Find this compound or compounds like it in BindingDB:
Activity Spreadsheet -- Enzyme Inhibition Constant Data from BindingDB
Found 1 hit for monomerid = 410911
TargetG-protein coupled bile acid receptor 1(Homo sapiens (Human))
Hoffmann-La Roche
US Patent
LigandPNGBDBM410911(N-[4-(2-Methoxy-phenyl)-pyridin-3-yl]-N-methyl-3,5...)
Affinity DataEC50:  11nM. Assay description: CHO-dhfr(minus) cells expressing human GPBAR1 receptors are seeded 17-24 hours prior to the experiment 50.000 cells per well in a black 96 well plate...
Ligand InfoPC cidPC sid
In DepthDetails US Patent