BDBM411036 N-(2-Methoxy-[3,4′]bipyridinyl-3′-yl)-N-methyl-3,5-bis-trifluoromethyl-benzamide::US10385022, Example 32
SMILES COc1ncccc1-c1ccncc1N(C)C(=O)c1cc(cc(c1)C(F)(F)F)C(F)(F)F
InChI Key InChIKey=MEODQJPRDLEZNT-UHFFFAOYSA-N
Data  1 EC50
  Tab Delimited (TSV)   2D SDfile   Computed 3D by Vconf -m prep SDfile
Find this compound or compounds like it in BindingDB:
Activity Spreadsheet -- Enzyme Inhibition Constant Data from BindingDB
Found 1 hit for monomerid = 411036
TargetG-protein coupled bile acid receptor 1(Homo sapiens (Human))
Hoffmann-La Roche
US Patent
LigandPNGBDBM411036(N-(2-Methoxy-[3,4′]bipyridinyl-3′-yl)-...)
Affinity DataEC50:  9nM. Assay description: CHO-dhfr(minus) cells expressing human GPBAR1 receptors are seeded 17-24 hours prior to the experiment 50.000 cells per well in a black 96 well plate...
Ligand InfoPC cidPC sid
In DepthDetails US Patent