BDBM41108 MLS000089550::N-(3-chlorophenyl)-N-ethyl-2-(1-ethyl-2-oxidanylidene-quinolin-4-yl)oxy-ethanamide::N-(3-chlorophenyl)-N-ethyl-2-(1-ethyl-2-oxoquinolin-4-yl)oxyacetamide::N-(3-chlorophenyl)-N-ethyl-2-[(1-ethyl-2-keto-4-quinolyl)oxy]acetamide::N-(3-chlorophenyl)-N-ethyl-2-[(1-ethyl-2-oxo-1,2-dihydroquinolin-4-yl)oxy]acetamide::N-(3-chlorophenyl)-N-ethyl-2-[(1-ethyl-2-oxo-4-quinolinyl)oxy]acetamide::SMR000027898::cid_3236055
SMILES CCN(C(=O)COc1cc(=O)n(CC)c2ccccc12)c1cccc(Cl)c1
InChI Key InChIKey=QHJMKPVTGSEYES-UHFFFAOYSA-N
Data  2 IC50
  Tab Delimited (TSV)   2D SDfile   Computed 3D by Vconf -m prep SDfile
Find this compound or compounds like it in BindingDB:
Activity Spreadsheet -- Enzyme Inhibition Constant Data from BindingDB
Found 2 hits for monomerid = 41108
TargetProcathepsin L(Homo sapiens (Human))
Pcmd
Curated by PubChem BioAssay
LigandPNGBDBM41108(MLS000089550 | N-(3-chlorophenyl)-N-ethyl-2-(1-eth...)
Affinity DataIC50: >5.00E+4nM. Assay description: Screening Center: Penn Center for Molecular Discovery Center Affiliation: University of Pennsylvania Network: Molecular Library Screening Center Netw...
In DepthDetails PCBioAssay
TargetCathepsin B(Homo sapiens (Human))
Pcmd
Curated by PubChem BioAssay
LigandPNGBDBM41108(MLS000089550 | N-(3-chlorophenyl)-N-ethyl-2-(1-eth...)
Affinity DataIC50: >5.00E+4nM. Assay description: Screening Center: Penn Center for Molecular Discovery Center Affiliation: University of Pennsylvania Network: Molecular Library Screening Center Netw...
In DepthDetails PCBioAssay