BDBM411083 N-[4-(2-Chloro-phenyl)-pyridin-3-yl]-3-hydroxy-N-methyl-5-trifluoromethyl-benzamide::US10385022, Example 79
SMILES CN(C(=O)c1cc(O)cc(c1)C(F)(F)F)c1cnccc1-c1ccccc1Cl
InChI Key InChIKey=PPAZWBCWVSHSLC-UHFFFAOYSA-N
Data  1 EC50
  Tab Delimited (TSV)   2D SDfile   Computed 3D by Vconf -m prep SDfile
Find this compound or compounds like it in BindingDB:
Activity Spreadsheet -- Enzyme Inhibition Constant Data from BindingDB
Found 1 hit for monomerid = 411083
TargetG-protein coupled bile acid receptor 1(Homo sapiens (Human))
Hoffmann-La Roche
US Patent
LigandPNGBDBM411083(N-[4-(2-Chloro-phenyl)-pyridin-3-yl]-3-hydroxy-N-m...)
Affinity DataEC50:  1.38E+3nM. Assay description: CHO-dhfr(minus) cells expressing human GPBAR1 receptors are seeded 17-24 hours prior to the experiment 50.000 cells per well in a black 96 well plate...
Ligand InfoPC cidPC sid
In DepthDetails US Patent