BDBM411203 N-Carbamoylmethyl-N-[4-(2-fluoro-6-methoxy-phenyl)-pyridin-3-yl]-2,6-bis-trifluoromethyl-isonicotinamide::US10385022, Example 199
SMILES COc1cccc(F)c1-c1ccncc1N(CC(N)=O)C(=O)c1cc(nc(c1)C(F)(F)F)C(F)(F)F
InChI Key InChIKey=BMYDPRXANMLMIM-UHFFFAOYSA-N
Data  1 EC50
  Tab Delimited (TSV)   2D SDfile   Computed 3D by Vconf -m prep SDfile
Find this compound or compounds like it in BindingDB:
Activity Spreadsheet -- Enzyme Inhibition Constant Data from BindingDB
Found 1 hit for monomerid = 411203
TargetG-protein coupled bile acid receptor 1(Homo sapiens (Human))
Hoffmann-La Roche
US Patent
LigandPNGBDBM411203(N-Carbamoylmethyl-N-[4-(2-fluoro-6-methoxy-phenyl)...)
Affinity DataEC50:  33nM. Assay description: CHO-dhfr(minus) cells expressing human GPBAR1 receptors are seeded 17-24 hours prior to the experiment 50.000 cells per well in a black 96 well plate...
Ligand InfoPC cidPC sid
In DepthDetails US Patent