BDBM411338 US10385031, Compound 044::US10774056, Compound 044::US11542242, Compound 044
SMILES Nc1ccc(cc1NC(=O)c1cnc(s1)N1CCNCC1)-c1ccccn1
InChI Key InChIKey=FQPSSFPWGUTZFL-UHFFFAOYSA-N
Data  9 IC50
  Tab Delimited (TSV)   2D SDfile   Computed 3D by Vconf -m prep SDfile
Find this compound or compounds like it in BindingDB:
Activity Spreadsheet -- Enzyme Inhibition Constant Data from BindingDB
Found 9 hits for monomerid = 411338
TargetHistone deacetylase 1(Homo sapiens (Human))
Regenacy Pharmaceuticals
US Patent
LigandPNGBDBM411338(US10385031, Compound 044 | US10774056, Compound 04...)
Affinity DataIC50: <1.00E+3nM. Assay description: Compounds for testing were diluted in DMSO to 50 fold the final concentration and a ten-point three-fold dilution series was made. The compounds were...
Ligand InfoPC cidPC sid
In DepthDetails US Patent
TargetHistone deacetylase 2(Homo sapiens (Human))
Regenacy Pharmaceuticals
US Patent
LigandPNGBDBM411338(US10385031, Compound 044 | US10774056, Compound 04...)
Affinity DataIC50: <1.00E+3nM. Assay description: Compounds for testing were diluted in DMSO to 50 fold the final concentration and a ten-point three-fold dilution series was made. The compounds were...
Ligand InfoPC cidPC sid
In DepthDetails US Patent
TargetHistone deacetylase 3(Homo sapiens (Human))
Regenacy Pharmaceuticals
US Patent
LigandPNGBDBM411338(US10385031, Compound 044 | US10774056, Compound 04...)
Affinity DataIC50: >500nM. Assay description: Compounds for testing were diluted in DMSO to 50 fold the final concentration and a ten-point three-fold dilution series was made. The compounds were...
Ligand InfoPC cidPC sid
In DepthDetails US Patent
TargetHistone deacetylase 1(Homo sapiens (Human))
Regenacy Pharmaceuticals
US Patent
LigandPNGBDBM411338(US10385031, Compound 044 | US10774056, Compound 04...)
Affinity DataIC50:  255nM. Assay description: Compounds for testing were diluted in DMSO to 50 fold the final concentration and a ten-point three-fold dilution series was made. The compounds were...
Ligand InfoPC cidPC sid
In DepthDetails US Patent
TargetHistone deacetylase 3(Homo sapiens (Human))
Regenacy Pharmaceuticals
US Patent
LigandPNGBDBM411338(US10385031, Compound 044 | US10774056, Compound 04...)
Affinity DataIC50: >500nM. Assay description: Compounds for testing were diluted in DMSO to 50 fold the final concentration and a ten-point three-fold dilution series was made. The compounds were...
Ligand InfoPC cidPC sid
In DepthDetails US Patent
TargetHistone deacetylase 3(Homo sapiens (Human))
Regenacy Pharmaceuticals
US Patent
LigandPNGBDBM411338(US10385031, Compound 044 | US10774056, Compound 04...)
Affinity DataIC50: >500nM
Ligand InfoPC cidPC sid
In DepthDetails US Patent
TargetHistone deacetylase 1(Homo sapiens (Human))
Regenacy Pharmaceuticals
US Patent
LigandPNGBDBM411338(US10385031, Compound 044 | US10774056, Compound 04...)
Affinity DataIC50:  255nM. Assay description: Compounds for testing were diluted in DMSO to 50 fold the final concentration and a ten-point three-fold dilution series was made. The compounds were...
Ligand InfoPC cidPC sid
In DepthDetails US Patent
TargetHistone deacetylase 2(Homo sapiens (Human))
Regenacy Pharmaceuticals
US Patent
LigandPNGBDBM411338(US10385031, Compound 044 | US10774056, Compound 04...)
Affinity DataIC50:  255nM. Assay description: Compounds for testing were diluted in DMSO to 50 fold the final concentration and a ten-point three-fold dilution series was made. The compounds were...
Ligand InfoPC cidPC sid
In DepthDetails US Patent
TargetHistone deacetylase 2(Homo sapiens (Human))
Regenacy Pharmaceuticals
US Patent
LigandPNGBDBM411338(US10385031, Compound 044 | US10774056, Compound 04...)
Affinity DataIC50:  255nM
Ligand InfoPC cidPC sid
In DepthDetails US Patent