BDBM411402 (R)-4-fluoro-N-(3-(1-isobutyryl-2,2-dimethylpiperidin-4-yl)-1-methyl-1H-indol-5-yl)benzenesulfonamide::US10385036, Example 18
SMILES CC(C)C(=O)N1CC[C@H](CC1(C)C)c1cn(C)c2ccc(NS(=O)(=O)c3ccc(F)cc3)cc12
InChI Key InChIKey=XRFOZCPJFWHAOT-GOSISDBHSA-N
Data  1 IC50
  Tab Delimited (TSV)   2D SDfile   Computed 3D by Vconf -m prep SDfile
Find this compound or compounds like it in BindingDB:
Activity Spreadsheet -- Enzyme Inhibition Constant Data from BindingDB
Found 1 hit for monomerid = 411402
TargetNuclear receptor ROR-gamma(Homo sapiens (Human))
Pfizer
US Patent
LigandPNGBDBM411402((R)-4-fluoro-N-(3-(1-isobutyryl-2,2-dimethylpiperi...)
Affinity DataIC50:  7nM. Assay description: In general, the assay is based on the interaction between N-terminally Six-Histidine-tagged-RORC2 ligand binding domain (6-His-RORC2 LBD), expressed ...
Ligand InfoPC cidPC sid
In DepthDetails US Patent