BDBM411486 US10392376, Example 43a::US10392376, Example 43b::US10800769, Example 43b::US11434233, Example 43a
SMILES C[C@@H]1COCCN1c1cc(N=[S@](C)(=O)C2COC2)nc(n1)-c1ccnc(N)c1
InChI Key InChIKey=HUEWJYKTEUFKCD-BODITIBLSA-N
Data  7 IC50
  Tab Delimited (TSV)   2D SDfile   Computed 3D by Vconf -m prep SDfile
Find this compound or compounds like it in BindingDB:
Activity Spreadsheet -- Enzyme Inhibition Constant Data from BindingDB
Found 7 hits for monomerid = 411486
TargetATR-interacting protein/Serine/threonine-protein kinase ATR(Homo sapiens (Human))
Board Of Regents, The University Of Texas System
US Patent
LigandPNGBDBM411486(US10392376, Example 43a | US10392376, Example 43b ...)
Affinity DataIC50:  153nM. Assay description: Human full-length FLAG-TEV-ATR and His6-ATRIP were co-expressed in HEK293 cells. The cell pellet (20 g) was harvested and lysed in 100 mL of lysis bu...
Ligand Info
In DepthDetails US Patent
TargetATR-interacting protein/Serine/threonine-protein kinase ATR(Homo sapiens (Human))
Board Of Regents, The University Of Texas System
US Patent
LigandPNGBDBM411486(US10392376, Example 43a | US10392376, Example 43b ...)
Affinity DataIC50:  387nM. Assay description: Human full-length FLAG-TEV-ATR and His6-ATRIP were co-expressed in HEK293 cells. The cell pellet (20 g) was harvested and lysed in 100 mL of lysis bu...
Ligand Info
In DepthDetails US Patent
TargetATR-interacting protein/Serine/threonine-protein kinase ATR(Homo sapiens (Human))
Board Of Regents, The University Of Texas System
US Patent
LigandPNGBDBM411486(US10392376, Example 43a | US10392376, Example 43b ...)
Affinity DataIC50:  153nM. Assay description: Human full-length FLAG-TEV-ATR and His6-ATRIP were co-expressed in HEK293 cells. The cell pellet (20 g) was harvested and lysed in 100 mL of lysis bu...
Ligand Info
In DepthDetails US Patent
TargetATR-interacting protein/Serine/threonine-protein kinase ATR(Homo sapiens (Human))
Board Of Regents, The University Of Texas System
US Patent
LigandPNGBDBM411486(US10392376, Example 43a | US10392376, Example 43b ...)
Affinity DataIC50:  153nM. Assay description: Human full-length FLAG-TEV-ATR and His6-ATRIP were co-expressed in HEK293 cells. The cell pellet (20 g) was harvested and lysed in 100 mL of lysis bu...
Ligand Info
In DepthDetails US Patent
TargetATR-interacting protein/Serine/threonine-protein kinase ATR(Homo sapiens (Human))
Board Of Regents, The University Of Texas System
US Patent
LigandPNGBDBM411486(US10392376, Example 43a | US10392376, Example 43b ...)
Affinity DataIC50:  387nM. Assay description: Human full-length FLAG-TEV-ATR and His6-ATRIP were co-expressed in HEK293 cells. The cell pellet (20 g) was harvested and lysed in 100 mL of lysis bu...
Ligand Info
In DepthDetails US Patent
TargetSerine/threonine-protein kinase Chk1(Homo sapiens (Human))
Board Of Regents, The University Of Texas System
US Patent
LigandPNGBDBM411486(US10392376, Example 43a | US10392376, Example 43b ...)
Affinity DataIC50:  399nM. Assay description: Inhibitors of ATR kinase are effective at inhibiting the ATR-driven phosphorylation of the downstream target Chk1 kinase at Serine 345, following the...
Ligand Info
In DepthDetails US Patent
TargetSerine/threonine-protein kinase Chk1(Homo sapiens (Human))
Board Of Regents, The University Of Texas System
US Patent
LigandPNGBDBM411486(US10392376, Example 43a | US10392376, Example 43b ...)
Affinity DataIC50:  44nM. Assay description: Inhibitors of ATR kinase are effective at inhibiting the ATR-driven phosphorylation of the downstream target Chk1 kinase at Serine 345, following the...
Ligand Info
In DepthDetails US Patent