BDBM411498 US10392376, Example 49::US10800769, Example 49::US11434233, Example 49
SMILES C[C@@H]1COCCN1c1cc(N=S(C)(C)=O)nc(n1)-c1cc(N)nc(c1)C(N)=O
InChI Key InChIKey=GGWRBPZRHXBHGP-SNVBAGLBSA-N
Data  4 IC50
  Tab Delimited (TSV)   2D SDfile   Computed 3D by Vconf -m prep SDfile
Find this compound or compounds like it in BindingDB:
Activity Spreadsheet -- Enzyme Inhibition Constant Data from BindingDB
Found 4 hits for monomerid = 411498
TargetATR-interacting protein/Serine/threonine-protein kinase ATR(Homo sapiens (Human))
Board Of Regents, The University Of Texas System
US Patent
LigandPNGBDBM411498(US10392376, Example 49 | US10800769, Example 49 | ...)
Affinity DataIC50:  159nM. Assay description: Human full-length FLAG-TEV-ATR and His6-ATRIP were co-expressed in HEK293 cells. The cell pellet (20 g) was harvested and lysed in 100 mL of lysis bu...
Ligand Info
In DepthDetails US Patent
TargetATR-interacting protein/Serine/threonine-protein kinase ATR(Homo sapiens (Human))
Board Of Regents, The University Of Texas System
US Patent
LigandPNGBDBM411498(US10392376, Example 49 | US10800769, Example 49 | ...)
Affinity DataIC50:  159nM. Assay description: Human full-length FLAG-TEV-ATR and His6-ATRIP were co-expressed in HEK293 cells. The cell pellet (20 g) was harvested and lysed in 100 mL of lysis bu...
Ligand Info
In DepthDetails US Patent
TargetSerine/threonine-protein kinase Chk1(Homo sapiens (Human))
Board Of Regents, The University Of Texas System
US Patent
LigandPNGBDBM411498(US10392376, Example 49 | US10800769, Example 49 | ...)
Affinity DataIC50:  7.59E+3nM. Assay description: Inhibitors of ATR kinase are effective at inhibiting the ATR-driven phosphorylation of the downstream target Chk1 kinase at Serine 345, following the...
Ligand Info
In DepthDetails US Patent
TargetATR-interacting protein/Serine/threonine-protein kinase ATR(Homo sapiens (Human))
Board Of Regents, The University Of Texas System
US Patent
LigandPNGBDBM411498(US10392376, Example 49 | US10800769, Example 49 | ...)
Affinity DataIC50:  159nM. Assay description: Human full-length FLAG-TEV-ATR and His6-ATRIP were co-expressed in HEK293 cells. The cell pellet (20 g) was harvested and lysed in 100 mL of lysis bu...
Ligand Info
In DepthDetails US Patent