BDBM411557 (R)-((2-(5-fluoro-2- methyl-1H-benzo[d]- imidazol-1-yl)-6-(3- methylmorpholino)- pyrimidin-4-yl)imino)- dimethyl-lambda6-sulfanone::US10392376, Example 108::US10800769, Example 108::US11434233, Example 108
SMILES C[C@@H]1COCCN1c1cc(N=S(C)(C)=O)nc(n1)-n1c(C)nc2cc(F)ccc12
InChI Key InChIKey=KMZIUDOUGCQURL-GFCCVEGCSA-N
Data  4 IC50
  Tab Delimited (TSV)   2D SDfile   Computed 3D by Vconf -m prep SDfile
Find this compound or compounds like it in BindingDB:
Activity Spreadsheet -- Enzyme Inhibition Constant Data from BindingDB
Found 4 hits for monomerid = 411557
TargetATR-interacting protein/Serine/threonine-protein kinase ATR(Homo sapiens (Human))
Board Of Regents, The University Of Texas System
US Patent
LigandPNGBDBM411557((R)-((2-(5-fluoro-2- methyl-1H-benzo[d]- imidazol-...)
Affinity DataIC50:  2nM. Assay description: Human full-length FLAG-TEV-ATR and His6-ATRIP were co-expressed in HEK293 cells. The cell pellet (20 g) was harvested and lysed in 100 mL of lysis bu...
Ligand Info
In DepthDetails US Patent
TargetATR-interacting protein/Serine/threonine-protein kinase ATR(Homo sapiens (Human))
Board Of Regents, The University Of Texas System
US Patent
LigandPNGBDBM411557((R)-((2-(5-fluoro-2- methyl-1H-benzo[d]- imidazol-...)
Affinity DataIC50:  2nM. Assay description: Human full-length FLAG-TEV-ATR and His6-ATRIP were co-expressed in HEK293 cells. The cell pellet (20 g) was harvested and lysed in 100 mL of lysis bu...
Ligand Info
In DepthDetails US Patent
TargetSerine/threonine-protein kinase Chk1(Homo sapiens (Human))
Board Of Regents, The University Of Texas System
US Patent
LigandPNGBDBM411557((R)-((2-(5-fluoro-2- methyl-1H-benzo[d]- imidazol-...)
Affinity DataIC50:  110nM. Assay description: Inhibitors of ATR kinase are effective at inhibiting the ATR-driven phosphorylation of the downstream target Chk1 kinase at Serine 345, following the...
Ligand Info
In DepthDetails US Patent
TargetATR-interacting protein/Serine/threonine-protein kinase ATR(Homo sapiens (Human))
Board Of Regents, The University Of Texas System
US Patent
LigandPNGBDBM411557((R)-((2-(5-fluoro-2- methyl-1H-benzo[d]- imidazol-...)
Affinity DataIC50:  2nM. Assay description: Human full-length FLAG-TEV-ATR and His6-ATRIP were co-expressed in HEK293 cells. The cell pellet (20 g) was harvested and lysed in 100 mL of lysis bu...
Ligand Info
In DepthDetails US Patent