BDBM412050 US10392391, Compound I-G-21::US10787452, Compound I-G-21::US11117900, Compound I-G-21::US11370798, Cmpd. # I-G-21::US20230271963, Compound I-G-21
SMILES COC1CN(C1)C(=O)C1CCN(CC1)c1c(F)cncc1NC(=O)c1c(N)nn2cc(F)cnc12
InChI Key InChIKey=AYLTWIHEUZXESW-UHFFFAOYSA-N
Data  10 KI
  Tab Delimited (TSV)   2D SDfile   Computed 3D by Vconf -m prep SDfile
Find this compound or compounds like it in BindingDB:
Activity Spreadsheet -- Enzyme Inhibition Constant Data from BindingDB
Found 10 hits for monomerid = 412050
TargetSerine/threonine-protein kinase ATR(Homo sapiens (Human))
Vertex Pharmaceuticals
US Patent
LigandPNGBDBM412050(US10392391, Compound I-G-21 | US10787452, Compound...)
Affinity DataKi: <10nM. Assay description: Compounds were screened for their ability to inhibit ATR kinase using a radioactive-phosphate incorporation assay. Assays were carried out in a mixtu...
Ligand Info
In DepthDetails US Patent
TargetSerine/threonine-protein kinase ATR(Homo sapiens (Human))
Vertex Pharmaceuticals
US Patent
LigandPNGBDBM412050(US10392391, Compound I-G-21 | US10787452, Compound...)
Affinity DataKi: <10nM. Assay description: Compounds were screened for their ability to inhibit ATR kinase using a radioactive-phosphate incorporation assay. Assays were carried out in a mixtu...
Ligand Info
In DepthDetails US Patent
TargetSerine/threonine-protein kinase ATR(Homo sapiens (Human))
Vertex Pharmaceuticals
US Patent
LigandPNGBDBM412050(US10392391, Compound I-G-21 | US10787452, Compound...)
Affinity DataKi: <10nM. Assay description: Assays were carried out at 25° C. in the presence of 5 nM full-length ATR. An assay stock buffer solution was prepared containing all of the reagents...
Ligand Info
In DepthDetails US Patent
LigandPNGBDBM412050(US10392391, Compound I-G-21 | US10787452, Compound...)
Affinity DataKi: <20nM. Assay description: Assays were carried out at 25° C. in the presence of 4 nM full-length ATR, 40 nM full-length ATRIP, 40 nM full-length CLK2 and 600 nM TopBP1(A891-S11...
Ligand Info
In DepthDetails US Patent
LigandPNGBDBM412050(US10392391, Compound I-G-21 | US10787452, Compound...)
Affinity DataKi: <200nM. Assay description: Table 7: Compounds were screened for their ability to inhibit ATR kinase, in the presence of partner proteins ATRIP, CLK2 and TopBP1, using a radioac...
Ligand Info
In DepthDetails US Patent
TargetSerine/threonine-protein kinase ATR(Homo sapiens (Human))
Vertex Pharmaceuticals
US Patent
LigandPNGBDBM412050(US10392391, Compound I-G-21 | US10787452, Compound...)
Affinity DataKi:  505nM. Assay description: Compounds were screened for their ability to inhibit ATR kinase using a radioactive-phosphate incorporation assay. Assays were carried out in a mixtu...
Ligand Info
In DepthDetails US Patent
TargetSerine/threonine-protein kinase ATR(Homo sapiens (Human))
Vertex Pharmaceuticals
US Patent
LigandPNGBDBM412050(US10392391, Compound I-G-21 | US10787452, Compound...)
Affinity DataKi:  505nM. Assay description: Compounds were screened for their ability to inhibit ATR kinase using a radioactive-phosphate incorporation assay. Assays were carried out in a mixtu...
Ligand Info
In DepthDetails US Patent
TargetSerine/threonine-protein kinase ATR(Homo sapiens (Human))
Vertex Pharmaceuticals
US Patent
LigandPNGBDBM412050(US10392391, Compound I-G-21 | US10787452, Compound...)
Affinity DataKi:  505nM. Assay description: Assays were carried out at 25° C. in the presence of 5 nM full-length ATR. An assay stock buffer solution was prepared containing all of the reagents...
Ligand Info
In DepthDetails US Patent
TargetSerine/threonine-protein kinase ATR(Homo sapiens (Human))
Vertex Pharmaceuticals
US Patent
LigandPNGBDBM412050(US10392391, Compound I-G-21 | US10787452, Compound...)
Affinity DataKi:  550nM. Assay description: Table 5: Compounds were screened for their ability to inhibit ATR kinase using a radioactive-phosphate incorporation assay. Assays were carried out i...
Ligand Info
In DepthDetails US Patent
TargetSerine/threonine-protein kinase ATR(Homo sapiens (Human))
Vertex Pharmaceuticals
US Patent
LigandPNGBDBM412050(US10392391, Compound I-G-21 | US10787452, Compound...)
Affinity DataKi:  3.00E+3nM. Assay description: Compounds were screened for their ability to inhibit ATR kinase using a radioactive-phosphate incorporation assay. Assays were carried out in a mixtu...
Ligand Info
In DepthDetails US Patent