BDBM41212 1-(3-pyridinyl)-N-(1,2,4-triazol-4-yl)ethanimine::1-(3-pyridyl)ethylidene-(1,2,4-triazol-4-yl)amine::1-pyridin-3-yl-N-(1,2,4-triazol-4-yl)ethanimine::MLS000078082::SMR000035892::cid_660536
SMILES CC(=Nn1cnnc1)c1cccnc1
InChI Key InChIKey=XLTUOJQWZDZJIJ-UHFFFAOYSA-N
Data  1 IC50
  Tab Delimited (TSV)   2D SDfile   Computed 3D by Vconf -m prep SDfile
Find this compound or compounds like it in BindingDB:
Activity Spreadsheet -- Enzyme Inhibition Constant Data from BindingDB
Found 1 hit for monomerid = 41212
TargetDNA-directed RNA polymerase subunit beta(Escherichia coli)
Pcmd
Curated by PubChem BioAssay
LigandPNGBDBM41212(1-(3-pyridinyl)-N-(1,2,4-triazol-4-yl)ethanimine |...)
Affinity DataIC50: >5.00E+4nM. Assay description: Screening Center: Penn Center for Molecular Discovery Center Affiliation: University of Pennsylvania Network: Molecular Library Screening Center Netw...
In DepthDetails PCBioAssay