BDBM412133 US10392402, Compound ID 48
SMILES COc1cccc(CNC(=O)Nc2cc([nH]n2)-c2ccncc2)c1F
InChI Key InChIKey=OTJIAHLXDJNQLL-UHFFFAOYSA-N
Data  2 IC50
  Tab Delimited (TSV)   2D SDfile   Computed 3D by Vconf -m prep SDfile
Find this compound or compounds like it in BindingDB:
Activity Spreadsheet -- Enzyme Inhibition Constant Data from BindingDB
Found 2 hits for monomerid = 412133
TargetRho-associated protein kinase 2(Homo sapiens (Human))
Translational Drug Development
US Patent
LigandPNGBDBM412133(US10392402, Compound ID 48)
Affinity DataIC50:  1.87E+3nM. Assay description: The following assay protocol is for measuring the phosphorylation of a peptide substrate (FAM-KKLRRTLSVA-OH wherein FAM is carboxyfluorescein). The p...
Ligand Info
In DepthDetails US Patent
TargetRho-associated protein kinase 1(Homo sapiens (Human))
Translational Drug Development
US Patent
LigandPNGBDBM412133(US10392402, Compound ID 48)
Affinity DataIC50:  6.40E+3nM. Assay description: The following assay protocol is for measuring the phosphorylation of a peptide substrate (FAM-KKLRRTLSVA-OH wherein FAM is carboxyfluorescein). The p...
Ligand Info
In DepthDetails US Patent