BDBM412148 US10392405, Compound Id 1.012::US11059834, Compound 1.012::US11691985, Compound 1.012
SMILES Cc1c(COc2cc3OCCCCC(=O)NCCCC[C@H](NCc3cc2Cl)C(O)=O)cccc1-c1ccccc1
InChI Key InChIKey=GHIPQHNIBMKRLS-NDEPHWFRSA-N
Data  3 IC50
  Tab Delimited (TSV)   2D SDfile   Computed 3D by Vconf -m prep SDfile
Find this compound or compounds like it in BindingDB:
Activity Spreadsheet -- Enzyme Inhibition Constant Data from BindingDB
Found 3 hits for monomerid = 412148
TargetProgrammed cell death 1 ligand 1(Homo sapiens (Human))
Chemocentryx
US Patent
LigandPNGBDBM412148(US10392405, Compound Id 1.012 | US11059834, Compou...)
Affinity DataIC50:  110nM. Assay description: Well plates were coated with 1 μg/mL of human PD-L1 (obtained from R&D) in PBS overnight at 4° C. The wells were then blocked with 2% BSA in PBS...
Ligand Info
In DepthDetails US Patent
LigandPNGBDBM412148(US10392405, Compound Id 1.012 | US11059834, Compou...)
Affinity DataIC50:  300nM. Assay description: 96 Well plates were coated with 1 μg/mL of human PD-L1 (obtained from R&D) in PBS overnight at 4° C. The wells were then blocked with 2% BSA in ...
Ligand Info
In DepthDetails US Patent
TargetProgrammed cell death 1 ligand 1(Homo sapiens (Human))
Chemocentryx
US Patent
LigandPNGBDBM412148(US10392405, Compound Id 1.012 | US11059834, Compou...)
Affinity DataIC50:  300nM. Assay description: 96 Well plates were coated with 1 μg/mL of human PD-L1 (obtained from R&D) in PBS overnight at 4° C. The wells were then blocked with 2% BSA in ...
Ligand Info
In DepthDetails US Patent