BDBM412373 N-(5-(2-chloro-5-(2-methylthiazol-4- yl)phenyl)pyrazin-2-yl)-4- methylnicotinamide::US10399967, Compound 3
SMILES Cc1nc(cs1)-c1ccc(Cl)c(c1)-c1cnc(NC(=O)c2cnccc2C)cn1
InChI Key InChIKey=IPZIGLBNGFFGLY-UHFFFAOYSA-N
Data  1 IC50
  Tab Delimited (TSV)   2D SDfile   Computed 3D by Vconf -m prep SDfile
Find this compound or compounds like it in BindingDB:
Activity Spreadsheet -- Enzyme Inhibition Constant Data from BindingDB
Found 1 hit for monomerid = 412373
TargetInterleukin-2(Homo sapiens (Human))
Prcl Research
US Patent
LigandPNGBDBM412373(N-(5-(2-chloro-5-(2-methylthiazol-4- yl)phenyl)pyr...)
Affinity DataIC50:  60nM. Assay description: Human peripheral blood mononuclear cells (PBMCs) are prepared from heparinized human blood by separation over a Ficoll density gradient.PBMCs are sti...
Ligand Info
In DepthDetails US Patent