BDBM412411 N-(4-(2-(benzyloxy)pyridin-3- yl)phenyl)-4-methylnicotinamide::US10399967, Compound 41
SMILES Cc1ccncc1C(=O)Nc1ccc(cc1)-c1cccnc1OCc1ccccc1
InChI Key InChIKey=HFFBSXYEOBBNRR-UHFFFAOYSA-N
Data  1 IC50
  Tab Delimited (TSV)   2D SDfile   Computed 3D by Vconf -m prep SDfile
Find this compound or compounds like it in BindingDB:
Activity Spreadsheet -- Enzyme Inhibition Constant Data from BindingDB
Found 1 hit for monomerid = 412411
TargetInterleukin-2(Homo sapiens (Human))
Prcl Research
US Patent
LigandPNGBDBM412411(N-(4-(2-(benzyloxy)pyridin-3- yl)phenyl)-4-methyln...)
Affinity DataIC50:  1.00E+3nM. Assay description: Human peripheral blood mononuclear cells (PBMCs) are prepared from heparinized human blood by separation over a Ficoll density gradient.PBMCs are sti...
Ligand Info
In DepthDetails US Patent