BDBM412460 N-(5-(5-(dimethylamino)-2- methylphenyl)pyridin-2-yl)-4- methylnicotinamide::US10399967, Compound 91
SMILES CN(C)c1ccc(C)c(c1)-c1ccc(NC(=O)c2cnccc2C)nc1
InChI Key InChIKey=YZGCLBKBFRYUOY-UHFFFAOYSA-N
Data  1 IC50
  Tab Delimited (TSV)   2D SDfile   Computed 3D by Vconf -m prep SDfile
Find this compound or compounds like it in BindingDB:
Activity Spreadsheet -- Enzyme Inhibition Constant Data from BindingDB
Found 1 hit for monomerid = 412460
TargetInterleukin-2(Homo sapiens (Human))
Prcl Research
US Patent
LigandPNGBDBM412460(N-(5-(5-(dimethylamino)-2- methylphenyl)pyridin-2-...)
Affinity DataIC50:  91nM. Assay description: Human peripheral blood mononuclear cells (PBMCs) are prepared from heparinized human blood by separation over a Ficoll density gradient.PBMCs are sti...
Ligand Info
In DepthDetails US Patent