BDBM412465 (Z)-N-(5-(1-(4-bromophenyl)prop-1- en-1-yl)pyridin-2-yl)-5-fluoro-4- methylnicotinamide hydrochloride::US10399967, Compound 136::US10399967, Compound 96
SMILES C\C=C(\c1ccc(Br)cc1)c1ccc(NC(=O)c2cncc(F)c2C)nc1
InChI Key InChIKey=ADJZVZYXLRGJER-YPEHOIGNSA-N
Data  2 IC50
  Tab Delimited (TSV)   2D SDfile   Computed 3D by Vconf -m prep SDfile
Find this compound or compounds like it in BindingDB:
Activity Spreadsheet -- Enzyme Inhibition Constant Data from BindingDB
Found 2 hits for monomerid = 412465
TargetInterleukin-2(Homo sapiens (Human))
Prcl Research
US Patent
LigandPNGBDBM412465((Z)-N-(5-(1-(4-bromophenyl)prop-1- en-1-yl)pyridin...)
Affinity DataIC50:  14nM. Assay description: Human peripheral blood mononuclear cells (PBMCs) are prepared from heparinized human blood by separation over a Ficoll density gradient.PBMCs are sti...
Ligand Info
In DepthDetails US Patent
TargetInterleukin-2(Homo sapiens (Human))
Prcl Research
US Patent
LigandPNGBDBM412465((Z)-N-(5-(1-(4-bromophenyl)prop-1- en-1-yl)pyridin...)
Affinity DataIC50:  105nM. Assay description: Human peripheral blood mononuclear cells (PBMCs) are prepared from heparinized human blood by separation over a Ficoll density gradient.PBMCs are sti...
Ligand Info
In DepthDetails US Patent